Target
Neuronal acetylcholine receptor subunit alpha-9
Ligand
BDBM50107863
Substrate
Ki
190±n/a nM
Comments
PDSP_609
Citation
 Mukhin, AGGündisch, DHorti, AGKoren, AOTamagnan, GKimes, ASChambers, JVaupel, DBKing, SLPicciotto, MRInnis, RBLondon, ED 5-Iodo-A-85380, an alpha4beta2 subtype-selective ligand for nicotinic acetylcholine receptors. Mol Pharmacol 57:642-9 (2000)  
Target
Name:
Neuronal acetylcholine receptor subunit alpha-9
Synonyms:
ACHA9_RAT Cholinergic, Nicotinic Muscle NACHR alpha 9 Nicotinic acetylcholine receptor subunit alpha 9
Type:
Enzyme Catalytic Domain
Mol. Mass.:
54522.69
Organism:
RAT
Description:
Cholinergic, Nicotinic Muscle 0 RAT::P43144
Residue:
479
  
Inhibitor
Name:
BDBM50107863
Synonyms:
(-)-cytisine (1S,9R)-7,11-diazatricyclo[7.3.1.0~2,7~]trideca-2,4-dien-6-one 1,2,3,4,5,6-Hexahydro-1,5-methano-pyrido[1,2-a][1,5]diazocin-8-one (cytisine) ChEMBL_66244 Cytisine1,2,3,4,5,6-Hexahydro-1,5-methano-pyrido[1,2-a][1,5]diazocin-8-one | cytisine
Type:
Small organic molecule
Emp. Form.:
C11H14N2O
Mol. Mass.:
190.2417
SMILES:
O=c1cccc2[C@H]3CNC[C@@H](C3)Cn12
: