Target
Nicotinic acetylcholine receptor
Ligand
BDBM50061565
Substrate
Ki
>10000±n/a nM
Comments
PDSP_1187
Citation
 Mukhin, AGGündisch, DHorti, AGKoren, AOTamagnan, GKimes, ASChambers, JVaupel, DBKing, SLPicciotto, MRInnis, RBLondon, ED 5-Iodo-A-85380, an alpha4beta2 subtype-selective ligand for nicotinic acetylcholine receptors. Mol Pharmacol 57:642-9 (2000)  
Target
Name:
Nicotinic acetylcholine receptor
Synonyms:
Nicotinic acetylcholine receptor | n-AChR
Type:
Enzyme Catalytic Domain
Mol. Mass.:
2478.99
Organism:
RAT
Description:
n-AChR 0 RAT::Q62594
Residue:
23
  
Inhibitor
Name:
BDBM50061565
Synonyms:
(+)Methyl-(2,3,3-trimethyl-bicyclo[2.2.1]hept-2-yl)-amine (-)Methyl-(2,3,3-trimethyl-bicyclo[2.2.1]hept-2-yl)-amine MECAMYLAMINE Methyl-(2,3,3-trimethyl-bicyclo[2.2.1]hept-2-yl)-amine(Mecamylamine)
Type:
Small organic molecule
Emp. Form.:
C11H21N
Mol. Mass.:
167.2911
SMILES:
CNC1(C)C2CCC(C2)C1(C)C
: