Target
Adenosine receptor A3
Ligand
BDBM21242
Substrate
Ki
18±n/a nM
Comments
PDSP_2880
Citation
 Varani, KMerighi, SGessi, SKlotz, KNLeung, EBaraldi, PGCacciari, BRomagnoli, RSpalluto, GBorea, PA [(3)H]MRE 3008F20: a novel antagonist radioligand for the pharmacological and biochemical characterization of human A(3) adenosine receptors. Mol Pharmacol 57:968-75 (2000) Target
Name:
Adenosine receptor A3
Synonyms:
A3 adenosine receptor (hA3) ADORA3 | Adenosine A3 receptor (A3AR)
Type:
G Protein-Coupled Receptor (GPCR)
Mol. Mass.:
36197.32
Organism:
Homo sapiens (Human)
Description:
P0DMS8
Residue:
318
  
Inhibitor
Name:
BDBM21242
Synonyms:
(2S,3S,4R,5R)-5-(6-{[(4-aminophenyl)methyl]amino}-9H-purin-9-yl)-3,4-dihydroxy-N-methyloxolane-2-carboxamide N(6)-(4-amino-3-iodobenzyl)adenosine-5-N-methyluronamide | [3H]AB-MECA
Type:
radiolabeled ligand
Emp. Form.:
C18H21N7O4
Mol. Mass.:
399.4038
SMILES:
CNC(=O)[C@H]1O[C@H]([C@H](O)[C@@H]1O)n1cnc2c(NCc3ccc(N)cc3)ncnc12
: