Target
5-hydroxytryptamine receptor 2C
Ligand
BDBM78576
Substrate
Ki
1311±n/a nM
Comments
PDSP_1850
Citation
 Herrick-Davis, KGrinde, ETeitler, M Inverse agonist activity of atypical antipsychotic drugs at human 5-hydroxytryptamine2C receptors. J Pharmacol Exp Ther 295:226-32 (2000) Target
Name:
5-hydroxytryptamine receptor 2C
Synonyms:
5-HT-2C 5-HT2C-INI 5-HTR2C 5-hydroxytryptamine receptor 2C (5-HT-2C) 5HT-1C HTR1C Serotonin (5-HT3) receptor Serotonin Receptor 2C
Type:
G Protein-Coupled Receptor (GPCR)
Mol. Mass.:
51836.79
Organism:
Homo sapiens (Human)
Description:
P28335
Residue:
458
  
Inhibitor
Name:
BDBM78576
Synonyms:
CIS-THIOTHIXENE SMR000058396 cid_941651 | med.21724, Compound Thiothixene
Type:
Small organic molecule
Emp. Form.:
C23H29N3O2S2
Mol. Mass.:
443.625
SMILES:
CN(C)S(=O)(=O)c1ccc2Sc3ccccc3\C(=C\CCN3CCN(C)CC3)c2c1
: