Target
Metabotropic glutamate receptor 1
Ligand
BDBM50013055
Substrate
Ki
340±n/a nM
Comments
PDSP_2014
Citation
 Mutel, VEllis, GJAdam, GChaboz, SNilly, AMesser, JBleuel, ZMetzler, VMalherbe, PSchlaeger, EJRoughley, BSFaull, RLRichards, JG Characterization of [(3)H]Quisqualate binding to recombinant rat metabotropic glutamate 1a and 5a receptors and to rat and human brain sections. J Neurochem 75:2590-601 (2000)  
Target
Name:
Metabotropic glutamate receptor 1
Synonyms:
GPRC1A GRM1_HUMAN Metabotropic Glutamate 1a | metabotropic glutamate 1
Type:
Enzyme
Mol. Mass.:
132358.19
Organism:
Homo sapiens (Human)
Description:
Q13255
Residue:
1194
  
Inhibitor
Name:
BDBM50013055
Synonyms:
2-aminopentanedioateglutamate glutamate(2-) | glutamic acid dianion
Type:
Small organic molecule
Emp. Form.:
C5H7NO4
Mol. Mass.:
145.1145
SMILES:
NC(CCC([O-])=O)C([O-])=O
: