Target
Metabotropic glutamate receptor 1
Ligand
BDBM17660
Substrate
Ki
10±n/a nM
Comments
PDSP_1580
Citation
 Mutel, VEllis, GJAdam, GChaboz, SNilly, AMesser, JBleuel, ZMetzler, VMalherbe, PSchlaeger, EJRoughley, BSFaull, RLRichards, JG Characterization of [(3)H]Quisqualate binding to recombinant rat metabotropic glutamate 1a and 5a receptors and to rat and human brain sections. J Neurochem 75:2590-601 (2000)  
Target
Name:
Metabotropic glutamate receptor 1
Synonyms:
GPRC1A GRM1_HUMAN Metabotropic Glutamate 1a | metabotropic glutamate 1
Type:
Enzyme
Mol. Mass.:
132358.19
Organism:
Homo sapiens (Human)
Description:
Q13255
Residue:
1194
  
Inhibitor
Name:
BDBM17660
Synonyms:
(2S)-2-amino-3-(3,5-dioxo-1,2,4-oxadiazolidin-2-yl)propanoic acid CHEMBL279956 Quisqualate, L | quisqualic acid
Type:
Small organic molecule
Emp. Form.:
C5H7N3O5
Mol. Mass.:
189.1262
SMILES:
N[C@@H](Cn1oc(=O)[nH]c1=O)C(O)=O
: