Target
Metabotropic glutamate receptor 5
Ligand
BDBM50030628
Substrate
Ki
2500±n/a nM
Comments
PDSP_3104
Citation
 Mutel, VEllis, GJAdam, GChaboz, SNilly, AMesser, JBleuel, ZMetzler, VMalherbe, PSchlaeger, EJRoughley, BSFaull, RLRichards, JG Characterization of [(3)H]Quisqualate binding to recombinant rat metabotropic glutamate 1a and 5a receptors and to rat and human brain sections. J Neurochem 75:2590-601 (2000)  
Target
Name:
Metabotropic glutamate receptor 5
Synonyms:
GPRC1E GRM5_HUMAN metabotropic glutamate 5 | metabotropic glutamate 5a
Type:
Enzyme
Mol. Mass.:
132484.72
Organism:
Homo sapiens (Human)
Description:
Residue:
1212
  
Inhibitor
Name:
BDBM50030628
Synonyms:
(S)-4C3HPG 4-(Amino-carboxy-methyl)-2-hydroxy-benzoic acid(S-4C3HPG) CHEMBL444589
Type:
Small organic molecule
Emp. Form.:
C9H9NO5
Mol. Mass.:
211.1715
SMILES:
NC(C(O)=O)c1ccc(C(O)=O)c(O)c1
: