Target
Metabotropic glutamate receptor 5
Ligand
BDBM50004899
Substrate
Ki
1500±n/a nM
Comments
PDSP_2016
Citation
 Mutel, VEllis, GJAdam, GChaboz, SNilly, AMesser, JBleuel, ZMetzler, VMalherbe, PSchlaeger, EJRoughley, BSFaull, RLRichards, JG Characterization of [(3)H]Quisqualate binding to recombinant rat metabotropic glutamate 1a and 5a receptors and to rat and human brain sections. J Neurochem 75:2590-601 (2000)  
Target
Name:
Metabotropic glutamate receptor 5
Synonyms:
GPRC1E GRM5_HUMAN metabotropic glutamate 5 | metabotropic glutamate 5a
Type:
Enzyme
Mol. Mass.:
132484.72
Organism:
Homo sapiens (Human)
Description:
Residue:
1212
  
Inhibitor
Name:
BDBM50004899
Synonyms:
(1R,2S)-2-((S)-Amino-carboxy-methyl)-cyclopropanecarboxylic acid CHEMBL285369 L-CCG-IV
Type:
Small organic molecule
Emp. Form.:
C6H9NO4
Mol. Mass.:
159.14
SMILES:
N[C@@H]([C@H]1C[C@H]1C(O)=O)C(O)=O
: