Target
Glutamate receptor 3
Ligand
BDBM50096327
Substrate
Ki
25±n/a nM
Comments
PDSP_576
Citation
 Menniti, FSChenard, BLCollins, MBDucat, MFElliott, MLEwing, FEHuang, JIKelly, KALazzaro, JTPagnozzi, MJWeeks, JLWelch, WMWhite, WF Characterization of the binding site for a novel class of noncompetitive alpha-amino-3-hydroxy-5-methyl-4-isoxazolepropionic acid receptor antagonists. Mol Pharmacol 58:1310-7 (2000)  
Target
Name:
Glutamate receptor 3
Synonyms:
GRIA3_RAT Glutamate receptor 3 Glutamate-AMPA | Gria3
Type:
Enzyme Catalytic Domain
Mol. Mass.:
100383.57
Organism:
RAT
Description:
Glutamate-AMPA GRIA3 RAT::P19492
Residue:
888
  
Inhibitor
Name:
BDBM50096327
Synonyms:
(R)-3-(2-Chloro-phenyl)-2-[(E)-2-(6-diethylaminomethyl-pyridin-2-yl)-vinyl]-6-fluoro-3H-quinazolin-4-one 3-(2-Chloro-phenyl)-2-[(E)-2-(6-diethylaminomethyl-pyridin-2-yl)-vinyl]-6-fluoro-3H-quinazolin-4-one CP-465022
Type:
Small organic molecule
Emp. Form.:
C26H24ClFN4O
Mol. Mass.:
462.946
SMILES:
CCN(CC)Cc1cccc(\C=C\c2nc3ccc(F)cc3c(=O)n2-c2ccccc2Cl)n1
: