Target
5-hydroxytryptamine receptor 2A
Ligand
BDBM50254790
Substrate
Ki
638±n/a nM
Comments
PDSP_1361
Citation
 Rothman, RBBaumann, MHSavage, JERauser, LMcBride, AHufeisen, SJRoth, BL Evidence for possible involvement of 5-HT(2B) receptors in the cardiac valvulopathy associated with fenfluramine and other serotonergic medications. Circulation 102:2836-41 (2000)  
Target
Name:
5-hydroxytryptamine receptor 2A
Synonyms:
5-HT-2A 5-HT2A 5-hydroxytryptamine receptor 2A (5HT2A) Htr2 Serotonin Receptor 2A
Type:
G Protein-Coupled Receptor (GPCR)
Mol. Mass.:
52852.05
Organism:
Rattus norvegicus (rat)
Description:
Rat cortex membranes 5-HT2A receptors.
Residue:
471
  
Inhibitor
Name:
BDBM50254790
Synonyms:
(S)-Norfluoxetine NORFLUOXETINE
Type:
Small organic molecule
Emp. Form.:
C16H16F3NO
Mol. Mass.:
295.2995
SMILES:
NCC[C@H](Oc1ccc(cc1)C(F)(F)F)c1ccccc1
: