Target
5-hydroxytryptamine receptor 2B
Ligand
BDBM50073444
Substrate
Ki
73.6±n/a nM
Comments
PDSP_1905
Citation
 Rothman, RBBaumann, MHSavage, JERauser, LMcBride, AHufeisen, SJRoth, BL Evidence for possible involvement of 5-HT(2B) receptors in the cardiac valvulopathy associated with fenfluramine and other serotonergic medications. Circulation 102:2836-41 (2000)  
Target
Name:
5-hydroxytryptamine receptor 2B
Synonyms:
5-HT-2B 5-hydroxytryptamine (serotonin) receptor 2B [Homo sapiens] 5-hydroxytryptamine receptor 2C (5HT2C) HTR2B Serotonin 2b (5-HT2b) receptor | Serotonin Receptor 2B
Type:
G Protein-Coupled Receptor (GPCR)
Mol. Mass.:
54312.47
Organism:
Homo sapiens (Human)
Description:
Receptor binding assays were performed using human clone stably expressed in CHO cells.
Residue:
481
  
Inhibitor
Name:
BDBM50073444
Synonyms:
2-{3-[4-(3-chlorophenyl)piperazin-1-yl]propyl}[1,2,4]triazolo[4,3-a]pyridin-3(2H)-one TRAZODONE
Type:
Small organic molecule
Emp. Form.:
C19H22ClN5O
Mol. Mass.:
371.864
SMILES:
Clc1cccc(c1)N1CCN(CCCn2nc3ccccn3c2=O)CC1
: