Target
Delta-type opioid receptor
Ligand
BDBM85731
Substrate
Ki
2100±n/a nM
Comments
PDSP_3254
Citation
 Schiller, PWNguyen, TMBerezowska, IDupuis, SWeltrowska, GChung, NNLemieux, C Synthesis and in vitro opioid activity profiles of DALDA analogues. Eur J Med Chem 35:895-901 (2000)  
Target
Name:
Delta-type opioid receptor
Synonyms:
DOR-1 MSL-2 OPRD_MOUSE Oprd1
Type:
Enzyme Catalytic Domain
Mol. Mass.:
40577.25
Organism:
MOUSE
Description:
P32300
Residue:
372
  
Inhibitor
Name:
BDBM85731
Synonyms:
[Dmt1]DALDA
Type:
Small organic molecule
Emp. Form.:
C32H49N9O5
Mol. Mass.:
639.7888
SMILES:
[#6]-c1cc(-[#8])cc(-[#6])c1-[#6]-[#6@H](-[#7])-[#6](=O)-[#7]-[#6@H](-[#6]-[#6]-[#6]\[#7]=[#6](\[#7])-[#7])-[#6](=O)-[#7]-[#6@@H](-[#6]-c1ccccc1)-[#6](=O)-[#7]-[#6@@H](-[#6]-[#6]-[#6]-[#6]-[#7])-[#6](-[#7])=O
: