Target
5-hydroxytryptamine receptor 1D
Ligand
BDBM50048803
Substrate
Ki
2.4±n/a nM
Comments
PDSP_1996
Citation
 Richelson, ESouder, T Binding of antipsychotic drugs to human brain receptors focus on newer generation compounds. Life Sci 68:29-39 (2000)  
Target
Name:
5-hydroxytryptamine receptor 1D
Synonyms:
5-HT-1D 5-HT1D 5HT1D_HUMAN HTR1DA Serotonin (5-HT) receptor | Serotonin Receptor 1D
Type:
G Protein-Coupled Receptor (GPCR)
Mol. Mass.:
41920.63
Organism:
Homo sapiens (Human)
Description:
Receptor binding assays were performed using human clone stably expressed in CHO cells.
Residue:
377
  
Inhibitor
Name:
BDBM50048803
Synonyms:
5-(2-(4-(benzo[d]isothiazol-3-yl)piperazin-1-yl)ethyl)-6-chloroindolin-2-one 5-[2-(4-Benzo[d]isothiazol-3-yl-piperazin-1-yl)-ethyl]-6-chloro-1,3-dihydro-indol-2-one (Ziprasidone) CHEMBL708 ZIPRASIDONE | ZIPRASIDONE HYDROCHLORIDE
Type:
Small organic molecule
Emp. Form.:
C21H21ClN4OS
Mol. Mass.:
412.936
SMILES:
Clc1cc2NC(=O)Cc2cc1CCN1CCN(CC1)c1nsc2ccccc12
: