Target
Histamine H3 receptor
Ligand
BDBM22883
Substrate
Ki
825±n/a nM
Comments
PDSP_671
Citation
 Liu, CMa, XJiang, XWilson, SJHofstra, CLBlevitt, JPyati, JLi, XChai, WCarruthers, NLovenberg, TW Cloning and pharmacological characterization of a fourth histamine receptor (H(4)) expressed in bone marrow. Mol Pharmacol 59:420-6 (2001)  
Target
Name:
Histamine H3 receptor
Synonyms:
G-protein coupled receptor 97 HH3R HRH3 Histamine H3 receptor (H3) Histamine receptor (H3 and H4)
Type:
G Protein-Coupled Receptor (GPCR)
Mol. Mass.:
48691.47
Organism:
Homo sapiens (Human)
Description:
Binding assays were using CHO cells stably expressing hH3R receptors.
Residue:
445
  
Inhibitor
Name:
BDBM22883
Synonyms:
CHEMBL12344 [3-(carbamimidoylsulfanyl)propyl]dimethylamine
Type:
Small organic molecule
Emp. Form.:
C6H15N3S
Mol. Mass.:
161.268
SMILES:
CN(C)CCCSC(N)=N
: