Target
Histamine H3 receptor
Ligand
BDBM22542
Substrate
Ki
0.4±n/a nM
Comments
PDSP_974
Citation
 Liu, CMa, XJiang, XWilson, SJHofstra, CLBlevitt, JPyati, JLi, XChai, WCarruthers, NLovenberg, TW Cloning and pharmacological characterization of a fourth histamine receptor (H(4)) expressed in bone marrow. Mol Pharmacol 59:420-6 (2001)  
Target
Name:
Histamine H3 receptor
Synonyms:
G-protein coupled receptor 97 HH3R HRH3 Histamine H3 receptor (H3) Histamine receptor (H3 and H4)
Type:
G Protein-Coupled Receptor (GPCR)
Mol. Mass.:
48691.47
Organism:
Homo sapiens (Human)
Description:
Binding assays were using CHO cells stably expressing hH3R receptors.
Residue:
445
  
Inhibitor
Name:
BDBM22542
Synonyms:
4-(1H-imidazol-4-ylmethyl)piperidine Immepip
Type:
Small organic molecule
Emp. Form.:
C9H15N3
Mol. Mass.:
165.2355
SMILES:
C(C1CCNCC1)c1cnc[nH]1
: