Target
Histamine H4 receptor
Ligand
BDBM50133003
Substrate
Ki
>10000±n/a nM
Comments
PDSP_99
Citation
 Liu, CMa, XJiang, XWilson, SJHofstra, CLBlevitt, JPyati, JLi, XChai, WCarruthers, NLovenberg, TW Cloning and pharmacological characterization of a fourth histamine receptor (H(4)) expressed in bone marrow. Mol Pharmacol 59:420-6 (2001)  
Target
Name:
Histamine H4 receptor
Synonyms:
AXOR35 GPCR105 HH4R HRH4 Histamine H4 receptor Histamine receptor (H3 and H4) SP9144
Type:
G Protein-Coupled Receptor (GPCR)
Mol. Mass.:
44517.02
Organism:
Homo sapiens (Human)
Description:
Binding assays were using CHO cells stably expressing hH4R receptors.
Residue:
390
  
Inhibitor
Name:
BDBM50133003
Synonyms:
4-(3-(piperidin-1-yl)propoxy)benzonitrile CHEMBL129257 | UCL-2138
Type:
Small organic molecule
Emp. Form.:
C15H20N2O
Mol. Mass.:
244.3321
SMILES:
N#Cc1ccc(OCCCN2CCCCC2)cc1
: