Target
Platelet-derived growth factor receptor beta
Ligand
BDBM3436
Substrate
Poly(E:Y)
Meas. Tech.
Kinase Inhibition Assay
IC50
>50000±n/a nM
Citation
 Schroeder, MCHamby, JMConnolly, CJGrohar, PJWinters, RTBarvian, MRMoore, CWBoushelle, SLCrean, SMKraker, AJDriscoll, DLVincent, PWElliott, WLLu, GHBatley, BLDahring, TKMajor, TCPanek, RLDoherty, AMShowalter, HD Soluble 2-substituted aminopyrido[2,3-d]pyrimidin-7-yl ureas. Structure-activity relationships against selected tyrosine kinases and exploration of in vitro and in vivo anticancer activity. J Med Chem 44:1915-26 (2001)  
Target
Name:
Platelet-derived growth factor receptor beta
Synonyms:
Beta-type platelet-derived growth factor receptor CD140b antigen PDGF Receptor Substrate PDGFR PDGFR-1 PDGFRB PGFRB_HUMAN Platelet-derived growth factor receptor 1 Platelet-derived growth factor receptor beta (PDGFR-beta) Platelet-derived growth factor receptor beta (PDGFRbeta) | VHL/PDGFRB
Type:
Enzyme
Mol. Mass.:
123922.25
Organism:
Homo sapiens (Human)
Description:
P09619
Residue:
1106
  
Inhibitor
Name:
BDBM3436
Synonyms:
6-(2,6-Dibromo-phenyl)-pyrido[2,3-d]pyrimidine-2,7-diamine 6-arylpyrido[2,3-d]pyrimidine deriv. 18 | ACS Chem. Biol. Compound 1
Type:
Small organic molecule
Emp. Form.:
C13H9Br2N5
Mol. Mass.:
395.052
SMILES:
Nc1ncc2cc(c(N)nc2n1)-c1c(Br)cccc1Br
:
Substrate
Name:
Poly(E:Y)
Synonyms:
Type:
Random polymer
Mol. Mass.:
358.43
Organism:
Description:
Random copolymer of glutamic acid and tyrosine (4:1). 50 uM ATP containing 0.4 uCi of [gamma-32P]ATP as co-substrate
Residue:
3
NA