Target
Proto-oncogene tyrosine-protein kinase Src
Ligand
BDBM3452
Substrate
Poly(E:Y)
Meas. Tech.
Kinase Inhibition Assay
IC50
12±n/a nM
Citation
 Schroeder, MCHamby, JMConnolly, CJGrohar, PJWinters, RTBarvian, MRMoore, CWBoushelle, SLCrean, SMKraker, AJDriscoll, DLVincent, PWElliott, WLLu, GHBatley, BLDahring, TKMajor, TCPanek, RLDoherty, AMShowalter, HD Soluble 2-substituted aminopyrido[2,3-d]pyrimidin-7-yl ureas. Structure-activity relationships against selected tyrosine kinases and exploration of in vitro and in vivo anticancer activity. J Med Chem 44:1915-26 (2001)  
Target
Name:
Proto-oncogene tyrosine-protein kinase Src
Synonyms:
Calmodulin/Proto-oncogene tyrosine-protein kinase Src Proto-oncogene c-Src SRC SRC_HUMAN V-src sarcoma (Schmidt-Ruppin A-2) viral oncogene homolog (avian) p60-Src | pp60c-src
Type:
Protein
Mol. Mass.:
59838.60
Organism:
Homo sapiens (Human)
Description:
P12931
Residue:
536
  
Inhibitor
Name:
BDBM3452
Synonyms:
1-cyclohexyl-3-[6-(2,6-dichlorophenyl)-2-{[4-(diethylamino)butyl]amino}pyrido[2,3-d]pyrimidin-7-yl]urea | 6-arylpyrido[2,3-d]pyrimidine deriv. 34
Type:
Small organic molecule
Emp. Form.:
C28H37Cl2N7O
Mol. Mass.:
558.546
SMILES:
CCN(CC)CCCCNc1ncc2cc(c(NC(=O)NC3CCCCC3)nc2n1)-c1c(Cl)cccc1Cl
:
Substrate
Name:
Poly(E:Y)
Synonyms:
Type:
Random polymer
Mol. Mass.:
358.43
Organism:
Description:
Random copolymer of glutamic acid and tyrosine (4:1). 50 uM ATP containing 0.4 uCi of [gamma-32P]ATP as co-substrate
Residue:
3
NA