Target
Alpha-2B adrenergic receptor
Ligand
BDBM81773
Substrate
Ki
46±n/a nM
Comments
PDSP_340
Citation
 Naselsky, DPAshton, DRuffolo, RRHieble, JP Rabbit alpha2-adrenoceptors: both platelets and adipocytes have alpha2A-pharmacology. J Pharmacol Exp Ther 298:219-25 (2001) Target
Name:
Alpha-2B adrenergic receptor
Synonyms:
ADA2B_RABIT Alpha-2B adrenergic receptor | adrenergic Alpha2
Type:
Enzyme Catalytic Domain
Mol. Mass.:
42909.14
Organism:
RABBIT
Description:
adrenergic Alpha2 0 RABBIT::O77830
Residue:
394
  
Inhibitor
Name:
BDBM81773
Synonyms:
BAM 1303 CAS_115219-10-8
Type:
Small organic molecule
Emp. Form.:
C25H25BrN4
Mol. Mass.:
461.397
SMILES:
CN1C[C@H](Cn2ccnc2-c2ccccc2)C[C@H]2[C@H]1Cc1c(Br)[nH]c3cccc2c13
: