Target
5-hydroxytryptamine receptor 2A
Ligand
BDBM35226
Substrate
Ki
>10000±n/a nM
Comments
PDSP_2048
Citation
 Millan, MJGobert, ALejeune, FNewman-Tancredi, ARivet, JMAuclair, APeglion, JL S33005, a novel ligand at both serotonin and norepinephrine transporters: I. Receptor binding, electrophysiological, and neurochemical profile in comparison with venlafaxine, reboxetine, citalopram, and clomipramine. J Pharmacol Exp Ther 298:565-80 (2001) Target
Name:
5-hydroxytryptamine receptor 2A
Synonyms:
5-HT-2 5-HT2A 5-hydroxytryptamine receptor 2A (5HT-2A) 5HT2A_HUMAN HTR2A | Serotonin receptor 2A
Type:
undefined
Mol. Mass.:
52607.65
Organism:
Homo sapiens (Human)
Description:
P28223
Residue:
471
  
Inhibitor
Name:
BDBM35226
Synonyms:
(S,S)-reboxetine Vestra
Type:
Small organic molecule
Emp. Form.:
C19H23NO3
Mol. Mass.:
313.3908
SMILES:
CCOc1ccccc1O[C@H]([C@@H]1CNCCO1)c1ccccc1
: