Target
Muscarinic acetylcholine receptor M1
Ligand
BDBM85817
Substrate
Ki
0.129±n/a nM
Comments
PDSP_2071
Citation
 Christopoulos, AGrant, MKAyoubzadeh, NKim, ONSauerberg, PJeppesen, LEl-Fakahany, EE Synthesis and pharmacological evaluation of dimeric muscarinic acetylcholine receptor agonists. J Pharmacol Exp Ther 298:1260-8 (2001) Target
Name:
Muscarinic acetylcholine receptor M1
Synonyms:
ACM1_HUMAN Cholinergic receptor, muscarinic 1 | Cholinergic, muscarinic M1
Type:
Protein
Mol. Mass.:
51442.54
Organism:
Homo sapiens (Human)
Description:
P11229
Residue:
460
  
Inhibitor
Name:
BDBM85817
Synonyms:
NNC 11-1585
Type:
Small organic molecule
Emp. Form.:
C30H32N6O2S2
Mol. Mass.:
572.744
SMILES:
C(Oc1nsnc1C1CN2CCC1CC2)C#Cc1ccc(cc1)C#CCOc1nsnc1C1CN2CCC1CC2
: