Target
Muscarinic acetylcholine receptor M2
Ligand
BDBM85817
Substrate
Ki
0.079±n/a nM
Comments
PDSP_2071
Citation
 Christopoulos, AGrant, MKAyoubzadeh, NKim, ONSauerberg, PJeppesen, LEl-Fakahany, EE Synthesis and pharmacological evaluation of dimeric muscarinic acetylcholine receptor agonists. J Pharmacol Exp Ther 298:1260-8 (2001) Target
Name:
Muscarinic acetylcholine receptor M2
Synonyms:
ACM2_HUMAN Cholinergic, muscarinic M2 Muscarinic acetylcholine receptor M2 and M5 | RecName: Full=Muscarinic acetylcholine receptor M2
Type:
GPCR
Mol. Mass.:
51730.61
Organism:
Homo sapiens (Human)
Description:
P08172
Residue:
466
  
Inhibitor
Name:
BDBM85817
Synonyms:
NNC 11-1585
Type:
Small organic molecule
Emp. Form.:
C30H32N6O2S2
Mol. Mass.:
572.744
SMILES:
C(Oc1nsnc1C1CN2CCC1CC2)C#Cc1ccc(cc1)C#CCOc1nsnc1C1CN2CCC1CC2
: