Target
Alpha-2B adrenergic receptor
Ligand
BDBM85818
Substrate
Ki
>10000±n/a nM
Comments
PDSP_2009
Citation
 Roth, BLErnsberger, PSteinberg, SARao, SRauser, LSavage, JHufeisen, SBerridge, MSMuzic, RF The in vitro pharmacology of the beta-adrenergic receptor pet ligand (s)-fluorocarazolol reveals high affinity for cloned beta-adrenergic receptors and moderate affinity for the human 5-HT1A receptor. Psychopharmacology (Berl) 157:111-4 (2001)  
Target
Name:
Alpha-2B adrenergic receptor
Synonyms:
ADA2B_HUMAN ADRA2L1 Adrenergic alpha2B Adrenergic receptor alpha Alpha-2 adrenergic receptor subtype C2 Alpha-2B adrenoreceptor | Alpha-2BAR
Type:
Enzyme
Mol. Mass.:
49964.20
Organism:
Homo sapiens (Human)
Description:
P18089
Residue:
450
  
Inhibitor
Name:
BDBM85818
Synonyms:
Fluorocarazolol,(R) | Fluorocarazolol,(S)
Type:
Small organic molecule
Emp. Form.:
C18H21FN2O2
Mol. Mass.:
316.3699
SMILES:
CC(CF)NCC(O)COc1cccc2[nH]c3ccccc3c12
: