Target
Bone morphogenetic protein receptor type-1A
Ligand
BDBM143311
Substrate
Meas. Tech.
Enzyme Assay
IC50
9.20±n/a nM
Citation
 Alimardanov, ACuny, GDGrewal, GSLee, AMcKew, JCMohedas, AHShen, MXu, XYu, PB BMP inhibitors and methods of use thereof US Patent  US10017516 Publication Date 7/10/2018 
Target
Name:
Bone morphogenetic protein receptor type-1A
Synonyms:
ACVRLK3 Activin receptor-like kinase 3 (ALK-3) BMR1A_HUMAN
Type:
Enzyme
Mol. Mass.:
60204.46
Organism:
Homo sapiens (Human)
Description:
P36894
Residue:
532
  
Inhibitor
Name:
BDBM143311
Synonyms:
US10017516, Compound 11 | US9682983, 11
Type:
Small organic molecule
Emp. Form.:
C28H28N6
Mol. Mass.:
448.5621
SMILES:
C[C@H]1CNC[C@@H](C)N1c1ccc(cc1)-c1cnc2c(cnn2c1)-c1cc(C)nc2ccccc12
: