Target
Bone morphogenetic protein receptor type-1A
Ligand
BDBM143566
Substrate
Meas. Tech.
Enzyme Assay
IC50
29.0±n/a nM
Citation
 Alimardanov, ACuny, GDGrewal, GSLee, AMcKew, JCMohedas, AHShen, MXu, XYu, PB BMP inhibitors and methods of use thereof US Patent  US10017516 Publication Date 7/10/2018 
Target
Name:
Bone morphogenetic protein receptor type-1A
Synonyms:
ACVRLK3 Activin receptor-like kinase 3 (ALK-3) BMR1A_HUMAN
Type:
Enzyme
Mol. Mass.:
60204.46
Organism:
Homo sapiens (Human)
Description:
P36894
Residue:
532
  
Inhibitor
Name:
BDBM143566
Synonyms:
US10017516, Compound 13 | US9682983, 13
Type:
Small organic molecule
Emp. Form.:
C27H25N5
Mol. Mass.:
419.5209
SMILES:
Cc1cc(-c2cnn3cc(cnc23)-c2ccc(cc2)C2CCNCC2)c2ccccc2n1
: