Target
Bone morphogenetic protein receptor type-1B
Ligand
BDBM148371
Substrate
Meas. Tech.
Enzyme Assay
IC50
2910±n/a nM
Citation
 Alimardanov, ACuny, GDGrewal, GSLee, AMcKew, JCMohedas, AHShen, MXu, XYu, PB BMP inhibitors and methods of use thereof US Patent  US10017516 Publication Date 7/10/2018 
Target
Name:
Bone morphogenetic protein receptor type-1B
Synonyms:
ALK-6 BMPR1B Bone morphogenetic protein receptor type-1B (BMPR1B)
Type:
Enzyme
Mol. Mass.:
56939.41
Organism:
Homo sapiens (Human)
Description:
O00238
Residue:
502
  
Inhibitor
Name:
BDBM148371
Synonyms:
US10017516, Compound 32 | US9682983, 32
Type:
Small organic molecule
Emp. Form.:
C30H31N5O
Mol. Mass.:
477.6
SMILES:
CC(C)(CN1CCCCC1)Oc1ccc(cc1)-c1cnc2c(cnn2c1)-c1cccc2ncccc12
: