Target
Bone morphogenetic protein receptor type-1A
Ligand
BDBM148379
Substrate
Meas. Tech.
Enzyme Assay
IC50
190±n/a nM
Citation
 Alimardanov, ACuny, GDGrewal, GSLee, AMcKew, JCMohedas, AHShen, MXu, XYu, PB BMP inhibitors and methods of use thereof US Patent  US10017516 Publication Date 7/10/2018 
Target
Name:
Bone morphogenetic protein receptor type-1A
Synonyms:
ACVRLK3 Activin receptor-like kinase 3 (ALK-3) BMR1A_HUMAN
Type:
Enzyme
Mol. Mass.:
60204.46
Organism:
Homo sapiens (Human)
Description:
P36894
Residue:
532
  
Inhibitor
Name:
BDBM148379
Synonyms:
US10017516, Compound 35 | US9682983, 35
Type:
Small organic molecule
Emp. Form.:
C25H21ClN6
Mol. Mass.:
440.927
SMILES:
Clc1cc(ccc1N1CCNCC1)-c1cnc2c(cnn2c1)-c1ccnc2ccccc12
: