Target
Receptor activity-modifying protein 1
Ligand
BDBM85840
Substrate
Ki
1.3±n/a nM
Comments
PDSP_2300
Citation
 Rorabaugh, BRScofield, MASmith, DDJeffries, WBAbel, PW Functional calcitonin gene-related peptide subtype 2 receptors in porcine coronary arteries are identified as calcitonin gene-related peptide subtype 1 receptors by radioligand binding and reverse transcription-polymerase chain reaction. J Pharmacol Exp Ther 299:1086-94 (2001) Target
Name:
Receptor activity-modifying protein 1
Synonyms:
CGRP1 RAMP1_PIG | Receptor activity-modifying protein 1
Type:
Enzyme Catalytic Domain
Mol. Mass.:
16766.13
Organism:
PIG
Description:
CGRP1 RAMP1 PIG::Q867C0
Residue:
148
  
Inhibitor
Name:
BDBM85840
Synonyms:
[N-acetyl]h alpha-CGRP8-37
Type:
Small organic molecule
Emp. Form.:
C141H232N44O39
Mol. Mass.:
3167.6222
SMILES:
CC(C)C[C@H](NC(=O)CNC(=O)[C@H](C)NC(=O)[C@H](CC(C)C)NC(=O)[C@H](CCCN=C(N)N)NC(=O)[C@H](Cc1cnc[nH]1)NC(=O)[C@@H](NC(=O)[C@@H](NC(C)=O)C(C)C)[C@@H](C)O)C(=O)N[C@@H](CC(C)C)C(=O)N[C@@H](CO)C(=O)N[C@@H](CCCN=C(N)N)C(=O)N[C@@H](CO)C(=O)NCC(=O)NCC(=O)N[C@@H](C(C)C)C(=O)N[C@@H](C(C)C)C(=O)N[C@@H](CCCCN)C(=O)N[C@@H](CC(N)=O)C(=O)N[C@@H](CC(N)=O)C(=O)N[C@@H](Cc1ccccc1)C(=O)N[C@@H](C(C)C)C(=O)N1CCC[C@H]1C(=O)N[C@@H]([C@@H](C)O)C(=O)N[C@@H](CC(N)=O)C(=O)N[C@@H](C(C)C)C(=O)NCC(=O)N[C@@H](CO)C(=O)N[C@@H](CCCCN)C(=O)N[C@@H](C)C(=O)N[C@@H](Cc1ccccc1)C(N)=O
: