Target
Sodium/nucleoside cotransporter
Ligand
BDBM84745
Substrate
Ki
1000±n/a nM
Comments
PDSP_763
Citation
 Bymaster, FPDreshfield-Ahmad, LJThrelkeld, PGShaw, JLThompson, LNelson, DLHemrick-Luecke, SKWong, DT Comparative affinity of duloxetine and venlafaxine for serotonin and norepinephrine transporters in vitro and in vivo, human serotonin receptor subtypes, and other neuronal receptors. Neuropsychopharmacology 25:871-80 (2001)  
Target
Name:
Sodium/nucleoside cotransporter
Synonyms:
Adenosine transporter
Type:
Enzyme Catalytic Domain
Mol. Mass.:
72613.74
Organism:
RAT
Description:
Adenosine transporter 0 RAT::Q91WW8
Residue:
659
  
Inhibitor
Name:
BDBM84745
Synonyms:
CAS_136434-34-9 LY-248686 USRE49340, Rank 5
Type:
Small organic molecule
Emp. Form.:
C18H19NOS
Mol. Mass.:
297.415
SMILES:
CNCC[C@H](Oc1cccc2ccccc12)c1cccs1
: