Target
Alpha-2B adrenergic receptor
Ligand
BDBM84745
Substrate
Ki
1000±n/a nM
Comments
PDSP_763
Citation
 Bymaster, FPDreshfield-Ahmad, LJThrelkeld, PGShaw, JLThompson, LNelson, DLHemrick-Luecke, SKWong, DT Comparative affinity of duloxetine and venlafaxine for serotonin and norepinephrine transporters in vitro and in vivo, human serotonin receptor subtypes, and other neuronal receptors. Neuropsychopharmacology 25:871-80 (2001)  
Target
Name:
Alpha-2B adrenergic receptor
Synonyms:
ADA2B_MOUSE Alpha-2 adrenergic receptor adrenergic Alpha2B
Type:
Enzyme Catalytic Domain
Mol. Mass.:
50186.21
Organism:
MOUSE
Description:
adrenergic Alpha2B ADRA2B MOUSE::P30545
Residue:
450
  
Inhibitor
Name:
BDBM84745
Synonyms:
CAS_136434-34-9 LY-248686 USRE49340, Rank 5
Type:
Small organic molecule
Emp. Form.:
C18H19NOS
Mol. Mass.:
297.415
SMILES:
CNCC[C@H](Oc1cccc2ccccc12)c1cccs1
: