Target
Adenosine receptor A3
Ligand
BDBM85618
Substrate
Ki
2±n/a nM
Comments
PDSP_2330
Citation
 Gessi, SVarani, KMerighi, SCattabriga, EIannotta, VLeung, EBaraldi, PGBorea, PA A(3) adenosine receptors in human neutrophils and promyelocytic HL60 cells: a pharmacological and biochemical study. Mol Pharmacol 61:415-24 (2002)  
Target
Name:
Adenosine receptor A3
Synonyms:
A3 adenosine receptor (hA3) ADORA3 | Adenosine A3 receptor (A3AR)
Type:
G Protein-Coupled Receptor (GPCR)
Mol. Mass.:
36197.32
Organism:
Homo sapiens (Human)
Description:
P0DMS8
Residue:
318
  
Inhibitor
Name:
BDBM85618
Synonyms:
CHEMBL302765 MRE 3008F20
Type:
Small organic molecule
Emp. Form.:
C21H20N8O3
Mol. Mass.:
432.4353
SMILES:
CCCn1cc2c(n1)nc(NC(=O)Nc1ccc(OC)cc1)n1nc(nc21)-c1ccco1
: