Target
D(2) dopamine receptor
Ligand
BDBM84637
Substrate
Ki
2158±n/a nM
Comments
PDSP_1576
Citation
 Kilts, JDConnery, HSArrington, EGLewis, MMLawler, CPOxford, GSO'Malley, KLTodd, RDBlake, BLNichols, DEMailman, RB Functional selectivity of dopamine receptor agonists. II. Actions of dihydrexidine in D2L receptor-transfected MN9D cells and pituitary lactotrophs. J Pharmacol Exp Ther 301:1179-89 (2002)  
Target
Name:
D(2) dopamine receptor
Synonyms:
D(2) dopamine receptor DOPAMINE D2 Long DRD2 Dopamine D2 receptor Dopamine D2 receptor (D2R) Dopamine2-like | d2
Type:
Cell-surface receptors
Mol. Mass.:
50647.10
Organism:
Homo sapiens (Human)
Description:
P14416
Residue:
443
  
Inhibitor
Name:
BDBM84637
Synonyms:
CAS_85760-74-3 NSC_54562 Quinpirole,(-) | US9359372, Quinpirole
Type:
Small organic molecule
Emp. Form.:
C13H21N3
Mol. Mass.:
219.3259
SMILES:
CCCN1CCC[C@@H]2Cc3[nH]ncc3C[C@@H]12
: