Target
Alpha-1B adrenergic receptor
Ligand
BDBM35234
Substrate
Ki
7585.78±n/a nM
Comments
PDSP_1348
Citation
 Vicentic, ARobeva, ARogge, GUberti, MMinneman, KP Biochemistry and pharmacology of epitope-tagged alpha(1)-adrenergic receptor subtypes. J Pharmacol Exp Ther 302:58-65 (2002)  
Target
Name:
Alpha-1B adrenergic receptor
Synonyms:
ADA1B_HUMAN Adrenergic alpha1B Adrenergic receptor alpha Alpha 1B-adrenoreceptor | Alpha-1B adrenergic receptor
Type:
Enzyme
Mol. Mass.:
56862.13
Organism:
Homo sapiens (Human)
Description:
P35368
Residue:
520
  
Inhibitor
Name:
BDBM35234
Synonyms:
DL-[7-3H]norepinephrine Noradrenaline,(+) | [3H]NE
Type:
radiolabeled ligand
Emp. Form.:
C8H11NO3
Mol. Mass.:
169.1778
SMILES:
NCC(O)c1ccc(O)c(O)c1
: