Target
Substance-P receptor
Ligand
BDBM50116078
Substrate
Ki
1.3±n/a nM
Comments
PDSP_3952
Citation
 Anthes, JCChapman, RWRichard, CEckel, SCorboz, MHey, JAFernandez, XGreenfeder, SMcLeod, RSehring, SRizzo, CCrawley, YShih, NYPiwinski, JReichard, GTing, PCarruthers, NCuss, FMBillah, MKreutner, WEgan, RW SCH 206272: a potent, orally active tachykinin NK(1), NK(2), and NK(3) receptor antagonist. Eur J Pharmacol 450:191-202 (2002)  
Target
Name:
Substance-P receptor
Synonyms:
NK-1 receptor NK1 Receptor NK1R_HUMAN Neurokinin-1 (NK-1) SPR TACR1 Tachykinin receptor 1 (NK1) | tachykinin
Type:
G Protein-Coupled Receptor (GPCR)
Mol. Mass.:
46254.43
Organism:
Homo sapiens (Human)
Description:
P25103
Residue:
407
  
Inhibitor
Name:
BDBM50116078
Synonyms:
3,5-Dichloro-N-[3-(3,4-dichloro-phenyl)-2-methoxyimino-5-(3-methylcarbamoylmethyl-2-oxo-[1,4']bipiperidinyl-1'-yl)-pentyl]-N-ethyl-benzamide SCH 206272
Type:
Small organic molecule
Emp. Form.:
C33H41Cl4N5O4
Mol. Mass.:
713.522
SMILES:
CNC(=O)CC1CCCN(C2CCN(CC[C@@H](\C(CN(C)C(=O)c3cc(Cl)cc(Cl)c3)=N\OC)c3ccc(Cl)c(Cl)c3)CC2)C1=O
: