Target
5-hydroxytryptamine receptor 2A
Ligand
BDBM50020680
Substrate
Ki
>10000±n/a nM
Comments
PDSP_1613
Citation
 Millan, MJMaiofiss, LCussac, DAudinot, VBoutin, JANewman-Tancredi, A Differential actions of antiparkinson agents at multiple classes of monoaminergic receptor. I. A multivariate analysis of the binding profiles of 14 drugs at 21 native and cloned human receptor subtypes. J Pharmacol Exp Ther 303:791-804 (2002)  
Target
Name:
5-hydroxytryptamine receptor 2A
Synonyms:
5-HT-2 5-HT2A 5-hydroxytryptamine receptor 2A (5HT-2A) 5HT2A_HUMAN HTR2A | Serotonin receptor 2A
Type:
undefined
Mol. Mass.:
52607.65
Organism:
Homo sapiens (Human)
Description:
P28223
Residue:
471
  
Inhibitor
Name:
BDBM50020680
Synonyms:
4-[2-(dipropylamino)ethyl]-1,3-dihydro-2H-indol-2-one ROPINIROLE
Type:
Small organic molecule
Emp. Form.:
C16H24N2O
Mol. Mass.:
260.3746
SMILES:
CCCN(CCC)CCc1cccc2NC(=O)Cc12
: