Target
Alpha-2C adrenergic receptor
Ligand
BDBM50025206
Substrate
Ki
6.03±n/a nM
Comments
PDSP_1863
Citation
 Millan, MJMaiofiss, LCussac, DAudinot, VBoutin, JANewman-Tancredi, A Differential actions of antiparkinson agents at multiple classes of monoaminergic receptor. I. A multivariate analysis of the binding profiles of 14 drugs at 21 native and cloned human receptor subtypes. J Pharmacol Exp Ther 303:791-804 (2002)  
Target
Name:
Alpha-2C adrenergic receptor
Synonyms:
ADA2C_HUMAN ADRA2L2 Adrenergic alpha2C Adrenergic receptor alpha Alpha-2 adrenergic receptor subtype C4 Alpha-2C adrenoreceptor | adrenergic, alpha-2C-, receptor [Homo sapiens]
Type:
Enzyme
Mol. Mass.:
49552.32
Organism:
Homo sapiens (Human)
Description:
P18825
Residue:
462
  
Inhibitor
Name:
BDBM50025206
Synonyms:
(6,7-Dihydroxy-1,2,3,4-tetrahydro-naphthalen-2-yl)-dimethyl-ammonium | TL99
Type:
Small organic molecule
Emp. Form.:
C12H18NO2
Mol. Mass.:
208.2763
SMILES:
C[NH+](C)C1CCc2cc(O)c(O)cc2C1
: