Target
D(1A) dopamine receptor
Ligand
BDBM50002173
Substrate
Ki
467.74±n/a nM
Comments
PDSP_3292
Citation
 Millan, MJMaiofiss, LCussac, DAudinot, VBoutin, JANewman-Tancredi, A Differential actions of antiparkinson agents at multiple classes of monoaminergic receptor. I. A multivariate analysis of the binding profiles of 14 drugs at 21 native and cloned human receptor subtypes. J Pharmacol Exp Ther 303:791-804 (2002)  
Target
Name:
D(1A) dopamine receptor
Synonyms:
DA D1 receptor DRD1 Dopamine D1 receptor Dopamine D1A
Type:
Enzyme
Mol. Mass.:
49303.43
Organism:
Homo sapiens (Human)
Description:
P21728
Residue:
446
  
Inhibitor
Name:
BDBM50002173
Synonyms:
3-(4-(3,6-dihydro-4-phenyl-1(2H)-pyridinyl)butyl)-1H-indol-5-ol 3-[4-(4-phenyl-3,6-dihydropyridin-1(2H)-yl)butyl]-1H-indol-5-ol roxindole
Type:
Small organic molecule
Emp. Form.:
C23H26N2O
Mol. Mass.:
346.4653
SMILES:
Oc1ccc2[nH]cc(CCCCN3CCC(=CC3)c3ccccc3)c2c1
: