Target
Histamine receptor H3
Ligand
BDBM22541
Substrate
Ki
0.08±n/a nM
Comments
PDSP_539
Citation
 Esbenshade, TAKrueger, KMMiller, TRKang, CHDenny, LIWitte, DGYao, BBFox, GBFaghih, RBennani, YLWilliams, MHancock, AA Two novel and selective nonimidazole histamine H3 receptor antagonists A-304121 and A-317920: I. In vitro pharmacological effects. J Pharmacol Exp Ther 305:887-96 (2003)  
Target
Name:
Histamine receptor H3
Synonyms:
HISTAMINE H3 | HRH3
Type:
Enzyme Catalytic Domain
Mol. Mass.:
16901.59
Organism:
Dog
Description:
Q865E3
Residue:
147
  
Inhibitor
Name:
BDBM22541
Synonyms:
Clobenpropit VUF 9153 VUF9153
Type:
Small organic molecule
Emp. Form.:
C14H17ClN4S
Mol. Mass.:
308.83
SMILES:
NC(SCCCc1cnc[nH]1)=NCc1ccc(Cl)cc1
: