Target
Transthyretin
Ligand
BDBM249464
Substrate
Meas. Tech.
Scintillation Proximity RBP4 Binding Assay
pH
7.4±n/a
Temperature
298.15±n/a K
IC50
16.0±n/a nM
Comments
extracted
Citation
 Petrukhin, KCioffi, CJohnson, GAllikmets, RFreeman, EChen, PConlon, MZhu, L Substituted 4-phenylpiperidines, their preparation and use US Patent  US10072016 Publication Date 9/11/2018 
Target
Name:
Transthyretin
Synonyms:
ATTR Prealbumin TTHY_HUMAN Transthyretin (TTR)
Type:
Enzyme
Mol. Mass.:
15884.31
Organism:
Homo sapiens (Human)
Description:
P02766
Residue:
147
  
Inhibitor
Name:
BDBM249464
Synonyms:
US10072016, Compound 63 US10913746, Compound 63 US9434727, 63 | US9777010, Compound 63
Type:
Small organic molecule
Emp. Form.:
C21H22F4N4O2
Mol. Mass.:
438.4186
SMILES:
CC(=O)N1CCc2c(C1)[nH]nc2C(=O)N1CCC(CC1)c1cccc(F)c1C(F)(F)F
: