Target
Transthyretin
Ligand
BDBM249466
Substrate
Meas. Tech.
Scintillation Proximity RBP4 Binding Assay
pH
7.4±n/a
Temperature
298.15±n/a K
IC50
12.7±n/a nM
Comments
extracted
Citation
 Petrukhin, KCioffi, CJohnson, GAllikmets, RFreeman, EChen, PConlon, MZhu, L Substituted 4-phenylpiperidines, their preparation and use US Patent  US10072016 Publication Date 9/11/2018 
Target
Name:
Transthyretin
Synonyms:
ATTR Prealbumin TTHY_HUMAN Transthyretin (TTR)
Type:
Enzyme
Mol. Mass.:
15884.31
Organism:
Homo sapiens (Human)
Description:
P02766
Residue:
147
  
Inhibitor
Name:
BDBM249466
Synonyms:
US10072016, Compound 65 US10913746, Compound 65 US9434727, 65 | US9777010, Compound 65
Type:
Small organic molecule
Emp. Form.:
C20H15F4N5O
Mol. Mass.:
417.3596
SMILES:
Fc1cccc(C2CCN(CC2)C(=O)c2nnc3ccc(cn23)C#N)c1C(F)(F)F
: