Target
Transthyretin
Ligand
BDBM249474
Substrate
Meas. Tech.
Scintillation Proximity RBP4 Binding Assay
pH
7.4±n/a
Temperature
298.15±n/a K
IC50
10.6±n/a nM
Comments
extracted
Citation
 Petrukhin, KCioffi, CJohnson, GAllikmets, RFreeman, EChen, PConlon, MZhu, L Substituted 4-phenylpiperidines, their preparation and use US Patent  US10072016 Publication Date 9/11/2018 
Target
Name:
Transthyretin
Synonyms:
ATTR Prealbumin TTHY_HUMAN Transthyretin (TTR)
Type:
Enzyme
Mol. Mass.:
15884.31
Organism:
Homo sapiens (Human)
Description:
P02766
Residue:
147
  
Inhibitor
Name:
BDBM249474
Synonyms:
US10072016, Compound 77 US10913746, Compound 77 US9434727, 73 US9777010, Compound 77
Type:
Small organic molecule
Emp. Form.:
C22H26F4N4O2
Mol. Mass.:
454.4611
SMILES:
COCCN1CCc2c(C1)[nH]nc2C(=O)N1CCC(CC1)c1cccc(F)c1C(F)(F)F
: