Target
Pro-FMRFamide-related neuropeptide FF
Ligand
BDBM86147
Substrate
Ki
2.2±n/a nM
Comments
PDSP_3003
Citation
 Engström, MBrandt, AWurster, SSavola, JMPanula, P Prolactin releasing peptide has high affinity and efficacy at neuropeptide FF2 receptors. J Pharmacol Exp Ther 305:825-32 (2003)  
Target
Name:
Pro-FMRFamide-related neuropeptide FF
Synonyms:
FMRFamide-related peptides Npff
Type:
Enzyme Catalytic Domain
Mol. Mass.:
13156.33
Organism:
RAT
Description:
NPFF 0 RAT::Q9WVA9
Residue:
114
  
Inhibitor
Name:
BDBM86147
Synonyms:
CAS_68615 NSC_68615
Type:
Small organic molecule
Emp. Form.:
C29H42N8O4S
Mol. Mass.:
598.76
SMILES:
[#6]-[#16]-[#6]-[#6]-[#6](-[#7]-[#6](=O)-[#6](-[#7])-[#6]-c1ccccc1)-[#6](=O)-[#7]-[#6](-[#6]-[#6]-[#6]\[#7]=[#6](\[#7])-[#7])-[#6](=O)-[#7]-[#6](-[#6]-c1ccccc1)-[#6](-[#7])=O
: