Target
Pro-FMRFamide-related neuropeptide FF
Ligand
BDBM86145
Substrate
Ki
15±n/a nM
Comments
PDSP_2996
Citation
 Engström, MBrandt, AWurster, SSavola, JMPanula, P Prolactin releasing peptide has high affinity and efficacy at neuropeptide FF2 receptors. J Pharmacol Exp Ther 305:825-32 (2003)  
Target
Name:
Pro-FMRFamide-related neuropeptide FF
Synonyms:
FMRFamide-related peptides Npff
Type:
Enzyme Catalytic Domain
Mol. Mass.:
13156.33
Organism:
RAT
Description:
NPFF 0 RAT::Q9WVA9
Residue:
114
  
Inhibitor
Name:
BDBM86145
Synonyms:
L-Met-L-Pro-L-His-L-Serr-L-Phe-L-Ala-L-Asn-L-Leu-L-Pro-L-Leu-L-Arg-L-Phe-NH2 RFamide-related peptide 1
Type:
Small organic molecule
Emp. Form.:
C64H96N18O12S
Mol. Mass.:
1341.625
SMILES:
CSCC[C@H](N)C(=O)N1CCC[C@H]1C(=O)N[C@@H](Cc1cnc[nH]1)C(=O)N[C@@H](Cc1ccccc1)C(=O)N[C@@H](C)C(=O)N[C@@H](CC(N)=O)C(=O)N[C@@H](CC(C)C)C(=O)N1CCC[C@H]1C(=O)N[C@@H](CC(C)C)C(=O)N[C@@H](CCCN=C(N)N)C(=O)N[C@@H](Cc1ccccc1)C(N)=O
: