Target
Muscarinic acetylcholine receptor M5
Ligand
BDBM86194
Substrate
Ki
>10000±n/a nM
Comments
PDSP_2977
Citation
 Shi, QSavage, JEHufeisen, SJRauser, LGrajkowska, EErnsberger, PWroblewski, JTNadeau, JHRoth, BL L-homocysteine sulfinic acid and other acidic homocysteine derivatives are potent and selective metabotropic glutamate receptor agonists. J Pharmacol Exp Ther 305:131-42 (2003)  
Target
Name:
Muscarinic acetylcholine receptor M5
Synonyms:
ACM5_HUMAN | CHRM5
Type:
PROTEIN
Mol. Mass.:
60102.35
Organism:
Homo sapiens (Human)
Description:
ChEMBL_1517990
Residue:
532
  
Inhibitor
Name:
BDBM86194
Synonyms:
CAS_109 NSC_109
Type:
Small organic molecule
Emp. Form.:
C3H7NO4S
Mol. Mass.:
153.157
SMILES:
NC(CS(O)=O)C(O)=O
: