Target
Metabotropic glutamate receptor 4
Ligand
BDBM86194
Substrate
Ki
>10000±n/a nM
Comments
PDSP_2977
Citation
 Shi, QSavage, JEHufeisen, SJRauser, LGrajkowska, EErnsberger, PWroblewski, JTNadeau, JHRoth, BL L-homocysteine sulfinic acid and other acidic homocysteine derivatives are potent and selective metabotropic glutamate receptor agonists. J Pharmacol Exp Ther 305:131-42 (2003)  
Target
Name:
Metabotropic glutamate receptor 4
Synonyms:
GRM4_RAT Grm4 Metabotropic glutamate receptor 4 (mGlu4) mGlu4 metabotropic glutamate 4a
Type:
Enzyme
Mol. Mass.:
101849.79
Organism:
Rattus norvegicus (Rat)
Description:
P31423
Residue:
912
  
Inhibitor
Name:
BDBM86194
Synonyms:
CAS_109 NSC_109
Type:
Small organic molecule
Emp. Form.:
C3H7NO4S
Mol. Mass.:
153.157
SMILES:
NC(CS(O)=O)C(O)=O
: