Target
Oxytocin receptor
Ligand
BDBM86209
Substrate
Ki
76±n/a nM
Comments
PDSP_6851
Citation
 Cirillo, RGillio Tos, ESchwarz, MKQuattropani, AScheer, AMissotten, MDorbais, JNichols, ABorrelli, FGiachetti, CGolzio, LMarinelli, PThomas, RJChevillard, CLaurent, FPortet, KBarberis, CChollet, A Pharmacology of (2S,4Z)-N-[(2S)-2-hydroxy-2-phenylethyl]-4-(methoxyimino) -1-[(2'-methyl[1,1'-biphenyl]-4-yl)carbonyl]-2-pyrrolidinecarboxamide, a new potent and selective nonpeptide antagonist of the oxytocin receptor. J Pharmacol Exp Ther 306:253-61 (2003)  
Target
Name:
Oxytocin receptor
Synonyms:
OT-R Otr Oxytocin
Type:
Enzyme Catalytic Domain
Mol. Mass.:
42889.28
Organism:
RAT
Description:
Oxytocin OXTR RAT::P70536
Residue:
388
  
Inhibitor
Name:
BDBM86209
Synonyms:
Atosiban NSC_0
Type:
Small organic molecule
Emp. Form.:
C43H67N11O12S2
Mol. Mass.:
994.189
SMILES:
CCOc1ccc(CC2NC(=O)CCSSCC(NC(=O)C(CC(N)=O)NC(=O)C(NC(=O)C(NC2=O)C(C)CC)C(C)O)C(=O)N2CCCC2C(=O)NC(CCCN)C(=O)NCC(N)=O)cc1
: