Target
Muscarinic acetylcholine receptor M2
Ligand
BDBM86231
Substrate
Ki
7600±n/a nM
Comments
PDSP_334
Citation
 Patel, SKrause, SMHamill, TChaudhary, ABurns, DHGibson, RA In vitro characterization of [3H]MethoxyPyEP, an mGluR5 selective radioligand. Life Sci 73:371-9 (2003)  
Target
Name:
Muscarinic acetylcholine receptor M2
Synonyms:
ACM2_RAT Chrm-2 | Chrm2
Type:
Enzyme Catalytic Domain
Mol. Mass.:
51555.53
Organism:
RAT
Description:
P10980
Residue:
466
  
Inhibitor
Name:
BDBM86231
Synonyms:
ATR Atropine,(-) CHEMBL195 US9333195, ATROPINE
Type:
Small organic molecule
Emp. Form.:
C17H23NO3
Mol. Mass.:
289.3694
SMILES:
CN1C2CCC1CC(C2)OC(=O)C(CO)c1ccccc1
: