Target
D(2) dopamine receptor
Ligand
BDBM22869
Substrate
Ki
7600±n/a nM
Comments
PDSP_552
Citation
 Patel, SKrause, SMHamill, TChaudhary, ABurns, DHGibson, RA In vitro characterization of [3H]MethoxyPyEP, an mGluR5 selective radioligand. Life Sci 73:371-9 (2003)  
Target
Name:
D(2) dopamine receptor
Synonyms:
DOPAMINE D2 DOPAMINE D2 Short Dopamine D2 receptor Drd2
Type:
G Protein-Coupled Receptor (GPCR)
Mol. Mass.:
50931.60
Organism:
Rattus norvegicus (rat)
Description:
P61169
Residue:
444
  
Inhibitor
Name:
BDBM22869
Synonyms:
6-chloro-10-(4-methylpiperazin-1-yl)-2,9-diazatricyclo[9.4.0.0^{3,8}]pentadeca-1,3(8),4,6,10,12,14-heptaene Clozapine US10259786, Clozapine
Type:
Small organic molecule
Emp. Form.:
C18H19ClN4
Mol. Mass.:
326.823
SMILES:
CN1CCN(CC1)C1=c2ccccc2=Nc2ccc(Cl)cc2N1
: