Target
D(1A) dopamine receptor
Ligand
BDBM86282
Substrate
Ki
1.9±n/a nM
Comments
PDSP_1723
Citation
 Neumeyer, JLKula, NSBergman, JBaldessarini, RJ Receptor affinities of dopamine D1 receptor-selective novel phenylbenzazepines. Eur J Pharmacol 474:137-40 (2003)  
Target
Name:
D(1A) dopamine receptor
Synonyms:
DOPAMINE D1 Dopamine D1 high Dopamine receptor Dopamine1-like Drd1a
Type:
Enzyme Catalytic Domain
Mol. Mass.:
49429.75
Organism:
RAT
Description:
P18901
Residue:
446
  
Inhibitor
Name:
BDBM86282
Synonyms:
6-Chloro-1-phenyl-2,3,4,5-tetrahydro-1H-benzo[d]azepine-7,8-diol; hydrobromide CHEMBL553503 SKF 81297 | cid_11957706
Type:
Small organic molecule
Emp. Form.:
C16H16ClNO2
Mol. Mass.:
289.757
SMILES:
Oc1cc2C(CNCCc2c(Cl)c1O)c1ccccc1
: