Target
Tyrosine-protein kinase JAK2
Ligand
BDBM277640
Substrate
Meas. Tech.
Biochemical JAK Assay
pH
7.5±n/a
Ki
<0.1±n/a nM
Comments
extracted
Citation
 Huang, XThalladi, VR Crystalline form of 3-((1R,3s,5S)-3-((7-((5-methyl-1H-pyrazol-3-yl)amino)-1,6-naphthyridin-5-yl)amino)-8-azabicyclo[3.2.1]octan-8-yl)propanenitrile US Patent  US10072026 Publication Date 9/11/2018 
Target
Name:
Tyrosine-protein kinase JAK2
Synonyms:
JAK-2 JAK2_HUMAN Janus kinase 2 (JAK2) | Janus kinase 2 (a protein tyrosine kinase)
Type:
Protein
Mol. Mass.:
130684.68
Organism:
Homo sapiens (Human)
Description:
O60674
Residue:
1132
  
Inhibitor
Name:
BDBM277640
Synonyms:
US10072026, Example 6-59 US11780852, Example 6-59
Type:
Small organic molecule
Emp. Form.:
C26H30N8O2S
Mol. Mass.:
518.634
SMILES:
Cc1cc(Nc2cc3ncc(cc3c(N[C@H]3C[C@@H]4CC[C@H](C3)N4Cc3ccncc3)n2)S(C)(=O)=O)n[nH]1
: